{"text_format":"1","workbook":"xlsx","n_sheets":5,"sheets":["PAYMENT MASTER","ITEM MASTER","MENU MASTER","FOOD TYPE MASTER","工作表1"],"not_rendered":{"charts":0,"images":0,"macros":1,"external_links":0,"defined_names":67,"comments":0,"pivot_tables":0},"unopened":[],"bounds":{"document_bytes":16777216,"sheet_cells":100000,"rows_first":2000,"rows_last":500,"rows_between":2000,"halvings":0,"cell_chars":16384,"cell_head_chars":4096},"cells_cut":0,"cells_raw":0,"read":"whole","date_system":"1900"}

{"sheet":"PAYMENT MASTER","index":0,"n_rows":23,"n_cols":5,"rows_kept":23,"cut":false,"hidden":false,"merged":[]}
[null,"基本付款扣減設定"]
[null,null,null,"VNB","WOW"]
[null,null,"Based on","Rate","Rate"]
[null,"VISA","By Total",2.1999999999999999E-2,2.1999999999999999E-2]
[null,null,"By Order",0,0]
[null,"MASTER","By Total",2.1999999999999999E-2,2.1999999999999999E-2]
[null,null,"By Order",0,0]
[null,"銀聯","By Total",2.1999999999999999E-2,2.1999999999999999E-2]
[null,null,"By Order",0,0]
[null,"八達通","By Total",1.2999999999999999E-2,1.2999999999999999E-2]
[null,null,"By Order",298,298]
[null,"支付寶","By Total",0.01,1.2E-2]
[null,null,"By Order",0,0]
[null,"WECHAT","By Total",0.01,0.01]
[null,null,"By Order",0,0]
[null,"戶戶送","By Total",0.33,0.33]
[null," ","By Order",0,0]
[null,"FOOD PANDA","By Total",0.33,0.33]
[null,null,"By Order",0,0]
[null,"UBEREATS","By Total",0.35,0.35]
[null,null,"By Order",0,0]
[null,"THE GULU","By Total",0.35,0.35]
[null,null,"By Order",0,0]

{"sheet":"ITEM MASTER","index":1,"n_rows":1166,"n_cols":13,"rows_kept":1166,"cut":false,"hidden":false,"merged":[]}
["產品對照表"]
["餐牌設定",null,null,null,"統計設定"]
["菜品編號","食品名","食品類別","字號","主類別","副類別","次類別","產品名稱","食材分類"]
["D01438","(6)鮮蝦雲吞河","早餐","品味","中式","中式粉麵飯","中式河","鮮蝦雲吞河","海鮮"]
["D01433","(下)212雞絲扎肉河","下午茶餐","品味","越式","越式粉麵飯","越式河","雞絲扎肉河","雞"]
["D01432","(下)214.幹炒牛河","下午茶餐","品味","中式","中式粉麵飯","中式河","乾炒牛河","牛"]
["D01431","(下)219.揚州炒飯","下午茶餐","品味","中式","中式粉麵飯","中式飯","揚州炒飯","粉麵飯"]
["D02052","(下)A.豬扒炒河","下午茶餐","品味","中式","中式粉麵飯","中式河","豬扒炒河","豬"]
["D02053","(下)B.田園菜粒炒飯","下午茶餐","品味","中式","中式粉麵飯","中式飯","田園菜粒炒飯","菜"]
["D02054","(下)C.豬肚絲拼豬肉丸湯河","下午茶餐","品味","越式","越式粉麵飯","越式河","豬肚絲豬肉丸湯河","豬"]
["D02055","(下)D.牛肉拼豬手湯河","下午茶餐","品味","中式","中式粉麵飯","中式河","牛肉拼豬手湯河","雜肉"]
["D02056","(下)E.蝦餅湯檬","下午茶餐","品味","越式","檬","湯檬","蝦餅湯檬","海鮮"]
["D02057","(下)F.雪菜肉碎豬肉丸米線","下午茶餐","品味","中式","中式粉麵飯","中式米線","雪菜肉碎豬肉丸米線","豬"]
["D02058","(下)G.豉油雞湯河粉","下午茶餐","品味","中式","中式粉麵飯","中式河","豉油雞湯河粉","雞"]
["D02104","(下)H.午餐肉肉碎飯","下午茶餐","品味","西式","西式粉麵飯","西式粉麵飯菜式","午餐肉肉碎飯","豬"]
["D01435","(下)牙車快","下午茶小食","品味","越式","越式素菜","越式素菜菜式","牙車快","菜"]
["D01525","1 水煮斑球","厨师推介","和味","中式","中式小菜","中式小菜菜式","水煮斑球","海鮮"]
["D02099","1.冬陰公三寶米線","午市套餐","品味","越式","越式粉麵飯","越式其他","冬陰功三寶米線","雜肉"]
["D02099","1.冬陰公三寶湯河","午市套餐","品味","越式","越式粉麵飯","越式河","冬陰功湯三寶湯河","雜肉"]
["D02099","1.冬陰公湯河","午市套餐","品味","越式","越式粉麵飯","越式河","冬陰功湯河","雜肉"]
["D01603","1.冬陰功三寶米線","精選午餐","和味","越式","越式粉麵飯","越式其他","冬陰功三寶米線","雜肉"]
["D01603","1.冬陰功三寶湯河","精選午餐","和味","越式","越式粉麵飯","越式河","冬陰功湯三寶湯河","雜肉"]
["D01603","1.冬陰功湯三寶湯河","精選午餐","和味","越式","越式粉麵飯","越式河","冬陰功湯三寶湯河","雜肉"]
["D01603","1.冬陰功湯河","精選午餐","和味","越式","越式粉麵飯","越式河","冬陰功湯河","雜肉"]
["D02099","1.冬蔭公湯三寶湯河","午市套餐","品味","越式","越式粉麵飯","越式河","冬陰功湯三寶湯河","雜肉"]
["D01603","1.鮮茄三寶米線","精選午餐","和味","越式","越式粉麵飯","越式其他","鮮茄三寶米線","雜肉"]
["D02099","1.鮮茄三寶米線","午市套餐","品味","越式","越式粉麵飯","越式其他","鮮茄三寶米線","雜肉"]
["D01603","1.鮮茄三寶湯河","精選午餐","和味","越式","越式粉麵飯","越式河","鮮茄三寶湯河","雜肉"]
["D02099","1.鮮茄三寶湯河","午市套餐","品味","越式","越式粉麵飯","越式河","鮮茄三寶湯河","雜肉"]
["D01569","101)迷你春卷撈檬",null,"品味","越式","檬","撈檬","迷你春卷撈檬","菜"]
{"$rows_left_out":1137}
{"sheet":"MENU MASTER","index":2,"n_rows":122,"n_cols":62,"rows_kept":122,"cut":false,"hidden":false,"merged":[]}
["Level 1","Level 2",null,null,null,null,null,null,null,"Level 3","Level 4"]
["主類別",null,null,null,null,null,null,null,null,"中式 ",null,null,null,null,null,null,null,null,null,null,null,null,null,null,null,null,null,"西式",null,null,null,null,null,"越式",null,null,null,null,null,null,null,null,null,null,null,null,null,null,null,null,null,null,null,null,null,null,"飲料"]
["中式","中式","西式","越式","飲料","其他","餐牌其他","套餐","雜項","中式頭盤","中式頭盤菜式","燒味","淨燒味","燒味飯","中式小菜","中式小菜菜式","中式海鮮","中式海鮮菜式","中式素菜","中式素菜菜式","中式粉麵飯","中式飯","中式河","中式米線","中式其他","中式湯","中式湯菜式","西式小食","西式小食菜式","西式麵包","西式麵包菜式","西式粉麵飯","西式粉麵飯菜式","越式小菜","越式小菜菜式","越式燒物","越式燒物菜式","越式海鮮","越式海鮮菜式","咖喱","咖喱菜式","越式素菜","越式素菜菜式","米紙卷","米紙卷菜式","檬","撈檬","湯檬","越式麵包","越式麵包菜式","越式粉麵飯","越式飯","越式河","越式其他","越式湯","越式湯菜式","酒精","酒精款式","無酒精","凍飲","熱飲","特飲"]
["西式","中式頭盤","西式小食","越式小菜","酒精","餐牌其他","套餐","早餐套餐","雜項","中式頭盤菜式","手拍青瓜","淨燒味","白切農場雞","明爐燒鵝飯","中式小菜菜式","XO\u007f醬雜菇炒蝦球\u007f","中式海鮮菜式","剁椒魚頭","中式素菜菜式","灼時蔬","中式飯","白飯","牛肉拼豬肉丸湯河","牛肉拼豬手米線","淨湯粉","中式湯菜式","例湯","西式小食菜式","煎荷包蛋","西式麵包菜式","菠蘿油","西式粉麵飯菜式","豬扒煎蛋飯","越式小菜菜式","越式炸香蕉","越式燒物菜式","香茅串焼雞肉","越式海鮮菜式","椒鹽軟殻蟹","咖喱菜式","咖喱牛腩鍋","越式素菜菜式","牙車快","米紙卷菜式","香芒軟殻蟹米紙卷","撈檬","鮮蝦撈檬","冬蔭公三寶湯檬","越式麵包菜式","蒜蓉包","越式飯","金菠羅海鮮炒飯","牛肉拼豬肉丸湯河","越式炒金邊粉","越式湯菜式","蕃茄蟹肉湯","酒精款式","紅酒","凍飲","凍咖啡","熱蜂蜜柚子茶","新鮮椰青"]
["越式","燒味","西式麵包","越式燒物","無酒精",null,"雜項","午餐套餐","一人套餐",null,"和味三小拼(海蜇.叉燒.青瓜)","燒味飯","白切雞脾","明爐燒鵝髀飯",null,"XO\u007f醬雜菇炒雞球\u007f",null,"明爐烏頭",null,"灼菜芯","中式河","叉燒鹹蛋飯","油雞湯河","雪菜肉碎豬肉丸米線","和味焼鵝濑",null,"豆腐魚頭雑菜湯",null,"薯條",null,"菠蘿包",null,"豬扒餐肉飯",null,"越式炸蝦餅",null,"香茅串焼牛肉",null,"湄公河大頭蝦",null,"咖喱軟殼蟹鍋",null,"馬拉盞炒通菜",null,"香茅豬頸肉米紙卷","湯檬","香茅牛肉撈檬","香茅牛肉湯檬",null,"越式豬頸肉三文治","越式河","香茅牛肉飯","牛肉拼豬肚絲湯河","馬拉盞野菌炒金邊粉","法式蕃茄蟹肉大頭蝦湯",null,null,"藍妹(大支)","熱飲","凍齋啡","熱香片茶","椰汁冰"]
["飲料","中式小菜","西式粉麵飯","越式海鮮",null,null,null,"晚餐套餐","外賣盒",null,"涼伴豬耳絲",null,"玫瑰豉油雞","脆皮燒腩仔飯",null,"叉燒炒滑蛋",null,"果皮蒸泥孟",null,"蒜蓉炒時蔬","中式米線","叉燒炒滑蛋飯","乾炒牛河","豬扒拼春卷米線","馬来炒貴刁",null,"粟米魚肚羹",null,"炸雞中翼配薯條",null,"脆脆豬仔包",null,"豬頸肉煎蛋飯",null,"蝦餠紮肉拼蝦片",null,"香茅串燒豬頸肉",null,"水煮鯇魚",null,"咖喱雑菜鍋",null,"馬拉盞時蔬",null,"焼大虎蝦米紙卷",null,"香茅牛肉豬耳絲撈檬","香茅豬頸肉串湯檬",null,"越式三文治","越式其他","香茅牛肉煎蛋飯","冬陰功湯三寶湯河","冬陰功三寶米線",null,null,null,"二鍋頭(細)","特飲","凍檸啡","越南滴漏咖啡","紅豆冰"]
["其他","中式海鮮",null,"咖喱",null,null,null,null,null,null,"涼伴豬肚絲",null,"豉油雞脾","蜜汁叉燒飯",null,"土魷蒸肉餅",null,"烤鯇魚",null,"清炒時蔬","中式其他","田園菜粒炒飯","乾炒雑菜河粉","豬肉丸雪菜米線","雪菜肉碎拼紅腸米粉",null,"海皇豆腐羹",null,"炸魚柳薯條",null,"奶油豬仔包",null,"雞扒飯",null,"迷你拼盤",null,"香茅串焼拼盤",null,null,null,"咖哩牛腩配蒜茸包",null,"馬拉盞炒菜",null,"香茅牛肉米紙卷",null,"香茅豬頸肉串撈檬","香茅雞扒湯檬",null,"扎肉包",null,"香茅牛肉餐肉飯","冬陰功湯河","鮮茄三寶米線",null,null,null,"青島啤酒(大支)",null,"凍奶茶","熱咖啡","綠豆冰"]
[" ","中式素菜",null,"越式素菜",null,null,null,null,null,null,"陳醋雲耳",null,"燒鵝皇","白切雞飯",null,"水煮斑球",null,"豉汁蒸盲魚曹",null,"清炒雑菜",null,"肉碎茄子飯","豉油皇野菌炒河粉","牛肉扎肉米線","米粉",null,null,null,"雞全翼配蒜蓉包",null,"脆脆豬扒包",null,"午餐肉肉碎飯",null,"迷你春卷",null,"串焼大虎蝦",null,null,null,null,null,null,null,"西堤素菜米紙卷",null,"香茅雞扒拼春卷撈檬","蝦餅扎肉湯檬",null,null,null,"香茅豬扒飯","和味皇牌湯河","豬扒拼春卷米線",null,null,null,"白酒(瓶)",null,"凍鴛鴦","熱齋啡","三色冰"]
[" ","中式粉麵飯",null,"米紙卷",null,null,null,null,null,null,"酸辣無骨鳯爪",null,"燒鵝脾","白切雞髀飯",null,"冬瓜火腩煲",null,"豉汁蒸倉魚",null,"郊外油菜",null,"豆腐火腩飯","豉油雞湯河粉","餐肉湯米線","無分類",null,null,null,"雞全翼配春卷",null,"雞扒包",null,"薯仔雞脾飯",null,"會安炸春卷",null,"焼雞肉串",null,null,null,null,null,null,null,"龍脷魚柳米紙卷",null,"香茅雞翼撈檬","蝦餅湯檬",null,null,null,"香茅雞扒拼餐肉飯","河內生牛肉湯河","越式雙拼麵",null,null,null,null,null,"凍檸檬茶","熱檸啡","菠蘿冰"]
[" ","中式湯",null,"檬",null,null,null,null,null,null,"蔥油海蜇",null,"鵝頭","豉油雞飯",null,"尖椒炒豬肚",null,"豉汁蒸烏頭",null,"姜汁芥菜",null,"咖喱牛腩飯","雪菜肉碎拼雲吞河","鮮茄雞絲豬肚絲米線","星州炒米粉",null,null,null,"豬肉串配薯條",null,"油占包",null,"雞扒餐肉飯",null,"雞全翼配春卷",null,"豬頸肉串",null,null,null,null,null,null,null,"越式扎肉米紙卷",null,"迷你春卷撈檬","豬肉丸拼豬肚絲湯檬",null,null,null,"香茅雞扒煎蛋飯","河內熟牛肉湯河","冬蔭公牛肉豬米線",null,null,null,null,null,"凍檸檬水","熱奶茶","芒果涼粉冰"]
[" ",null,null,"越式麵包",null,null,null,null,null,null,null,null,"紅燒乳鴿","豉油雞髀飯",null,"肉碎茄子煲",null,"豉汁蒸魚頭",null,"灼白菜",null,"南乳豬手飯","雪菜豬耳絲湯河","魚柳湯米線","雲吞4粒",null,null,null,"牛肉串配薯條",null,"奶醬包",null,"雞翼拼豬頸肉飯",null,"法式牛油雞翼",null,"串燒大虎蝦",null,null,null,null,null,null,null,null,null,"蝦餅扎肉撈檬","豬肉丸拼雞絲湯檬",null,null,null,"香茅雞扒飯","河内雞絲湯河","豬扒煎蛋冬蔭公米線",null,null,null,null,null,"凍檸蜜","熱鴛鴦","珍多冰"]
[null,null,null,"越式粉麵飯",null,null,null,null,null,null,null," ","脆皮三層焼腩仔","雙拼飯",null,"西芹雲耳炒雞柳",null,"豉汁蒸鱔",null,"清炒通菜",null,"海皇豆腐飯","雪菜豬肚絲湯河",null,null,null,null,null,"雞肉串配薯條",null,"蛋三文治",null,"雞翼煎蛋飯",null,"香茅雞翼",null,null,null,null,null,null,null,null,null,null,null,"蝦餅拼春卷撈檬","豬肉丸雞絲湯檬",null,null,null,"香茅雞翼煎蛋飯","品味湯河粉","豬頸肉金邊粉",null,null,null,null,null,"凍檸賓","熱檸檬茶","薄荷葉鮮青檸梳打"]
[null,null,null,"越式湯",null,null,null,null,null,null,null,null,"蜜汁叉燒","燒味三寶飯",null,"沙嗲金菇肥牛粉絲煲",null,"豉油皇大虎蝦",null,null,null,"海皇蛋白炒飯","豬手牛肉湯河",null,null,null,null,null,null,null,"炒蛋三文治",null,"叉燒炒滑蛋飯",null,"香茅豬扒",null,null,null,null,null,null,null,null,null,null,null,"蝦餅拼豬扒撈檬","豬頸肉拼春卷湯檬",null,null,null,"香葉肉碎伴太陽蛋飯","香茅豬扒河","鮮茄雞扒煎蛋米線",null,null,null,null,null,"凍檸樂","熱檸檬水","鹹檸七喜"]
[null,null,null,null,null,null,null,null,null,null,null,null,"燒味三拼","燒味四寶飯",null,"豆豉凌魚油麥菜",null,"椒鹽虎蝦",null,null,null,"涼瓜牛肉飯","豬扒炒河",null,null,null,null,null,null,null,"餐蛋三文治",null,"腸仔餐肉煎蛋公仔麵",null,"香茅雞扒"," ",null,null,null,null,null,null,null,null,null,null,"豬扒雞絲撈檬","鮮茄豬肉丸扎肉湯檬",null,null,null,"馬拉盞時蔬飯","香茅豬扒拼春卷河","豬肚絲豬肉丸米線",null,null,null,null,null,"凍阿華田","熱檸蜜","可樂"]
[null,null,null,null,null,null,null,null,null,null,null,null,"燒味四寶飯","海蜇燻蹄飯",null,"豆豉凌魚油麥菜炒扎肉",null,"煎倉魚",null,null,null,"通菜炒鮮魷飯","豬肚絲拼豬肉丸湯河",null,null,null,null,null,null,null,"雙拼三文治",null,"午餐肉煎蛋公仔麵",null,"順化蔗蝦",null,null,null,null,null,null,null,null,null,null,null,"豬頸肉拼扎肉撈檬","鮮茄蟹肉丸湯檬",null,null,null,"越式三拼飯","香茅豬扒湯河","豬肚絲扎肉米線"," ",null,null,null,null,"凍好立克","熱檸賓","無糖可樂"]
[null,null,null,null,null,null,null,null,null,null,null,null,"燒味雙拼","燻蹄飯",null,"豆腐火腩煲",null,"蒸東星魚",null,null,null,"揚州炒飯","鮮蝦雲吞河",null,null,null,null,null,null,null,"公司三文治",null,"豬扒炒公仔麵",null,"馬拉盞通菜豬頸肉",null,null,null,null,null,null,null,null,null,null,null,"豬頸肉拼春卷撈檬","雞扒拼春卷湯檬",null,null,null,"越式三寶飯","香茅雞扒湯河",null," ",null,null,null,null,"凍巧克力","熱檸樂","雪碧"]
[null,null,null,null,null,null,null,null,null,null,null,null,"鹹蛋","叉燒油雞飯",null,"豆腐魚腩煲",null,"辣椒魚頭",null,null,null,"椒鹽鮮魷飯","牛肉拼豬手湯河",null,null,null,null,null,null,null,"奶油多",null,"雞扒炒公仔麵",null,"香茅豬頸肉",null,null,null,null,null,null," ",null,null,null,null,"雞扒拼春卷撈檬","春卷湯檬",null,null,null,"越式炒飯","迷你春卷湯河",null,null,null,null,null,null,"凍杏雙","熱阿華田","梳打水"]
[null,null,null,null,null,null,null,null,null,null,null,null,"迷你拼盤","燒腩仔切雞飯",null,"咖哩豬扒鍋",null,"鮑魚拼鮑片",null,null,null,"菜心炒牛肉飯","豬手豬肚絲湯河",null,null,null,null,null,null,null,"雙拼多士",null,"豬頸肉炒公仔麵",null,null,null,null,null,null,null,null,null,null,null,null,null,"雞絲扎肉芝麻醬撈檬","豬手雞絲湯檬",null,null,null,"蝦餅肉碎飯","越式三寶湯河",null,null,null,null,null,null,"凍菜蜜","熱好立克","檸七喜"]
[null,null,null,null,null,null,null,null,null,null,null,null,"乳豬全體","燒肉鹹蛋飯",null,"咖哩雞鍋",null,"薑蔥蒸黃花魚",null,null,null,"菠蘿咕嚕肉飯",null,null,null,null,null,null,null,null,"西多士",null,"叉燒煎蛋通粉"," ",null,null,null,null,null,null,null,null,null,null,null,null,"香茅豬扒撈檬","鮮茄三寶湯檬",null,null,null,"蝦餅拼餐肉飯","越南扎肉湯河",null,null,null,null,null,null,"凍利賓納","熱巧克力","蒸餾水"]
[null,null,null,null,null,null,null,null,null,null,null,null,null,null,null,"枝竹豆卜火腩飯",null,"薑蔥蒸鯇魚",null,null,null,"菠蘿海鮮炒飯",null,null,null,null,null," ",null,null,"火腿蛋三文治",null,"雞絲煎蛋通粉",null,null,null,null,null,null,null,null," ",null,null,null,null,"香茅雞扒撈檬","雞扒煎蛋冬蔭公豬湯檬",null,null,null,"豬頸肉飯","豬肉丸拼豬肚絲湯河",null,null,null,null,null,null,"凍柚子蜜","熱柚子蜜"]
[null,null,null,null,null,null,null,null,null,null,null,null,null,null,null,"枝竹豬肚煲",null,"豉汁涼瓜倉魚",null,null,null,"黑椒豬手飯",null,null,null,null,null," ",null,null,"魚柳包",null,"雞扒肉碎飯"," ",null,null,null,null,null,null,null,null,null,null,null,null,null,"鮮蝦湯檬",null,null,null,"餐肉肉碎飯","豬肚絲拼扎肉湯河",null,null,null,null,null,null,"凍紅豆咖啡","熱紅豆咖啡"]
[null,null,null,null,null,null,null,null,null,null,null,null,null,null,null,"虎皮尖椒肉碎",null,"椒鹽魚腩",null,null,null,"滑蛋蝦仁飯",null,null,null," ",null,null,null,null,"魚柳三文治",null,"豬扒雞翼飯"," ",null,null,null,null,null,null,null,null,null,null,null,null,null,null,null,null,null,"欖菜薑米蛋白炒飯","豬肚絲豬肉丸湯河",null,null,null,null,null,null,"凍紅豆奶茶","熱紅豆奶茶"]
[null,null,null,null,null,null,null,null,null,null,null,null," ",null,null,"青瓜雲耳炒牛肉",null,"蒸倉魚",null,null,null,"蒜蓉炒時蔬飯",null,null,null,null,null,null,null,null,null,null,"雞扒煎蛋飯",null,null,null,null,null,null,null,null,null,null,null,null," ",null,null,null,null,null,"蝦餅煎蛋飯","鮮茄三寶湯河",null,null,null,null,null,null,null,"杏仁霜"]
[null,null,null,null,null,null,null,null,null,null,null,null,null,null,null,"南瓜蒸排骨",null,"冬菜蒸黃花魚",null,null,null,"薑米菜粒炒飯",null,null,null,null,null,null,null,null,null," ","雞扒香腸飯",null,null,null,null,null,null,null,null,null,null,null,null," ",null,null,null,null,null,"豬頸肉蝦餅飯","雞扒拼春卷湯河",null,null,null,null,null,null,null,"熱利賓納"]
[null,null,null,null,null,null,null,null,null,null,null,null,null,null,null,"紅青椒炒牛肉",null,"酸菜鯇魚鍋",null,null,null,"醬爆豬頸肉飯",null,null,null,null,null,null,null,null,null,null,"豬頸肉腸仔飯",null,null,null,null,null,null,null,null,null,null,null,null," ",null,null,null,null,null,"香茅牛肉腸仔飯","雞絲扎肉河",null,null,null,null,null,null,null,"熱菜蜜"]
[null,null,null,null,null,null,null,null,null,null,null,null,null,null,null,"茄子班腩煲",null,"茄汁大虎蝦",null,null,null,"欖菜薑米炒飯",null,null,null,null,null,null,null,null,null,null,"麥皮",null,null,null,null,null,null," ",null,null,null,null,null,null,null,null,null,null,null,"蝦餅餐肉飯","豬手扎肉湯河"]
[null,null,null,null,null,null,null,null,null,null,null,null,null,null,null,"時菜炒斑球",null,"酸菜烤魚",null,null,null,"枝竹羊腩飯",null,null,null,null,null,null,null,null,null,null,"雞翼腸仔飯",null,null,null,null,null,null," ",null,null,null," ",null,null,null,null,null,null,null,"冬陰公海鮮飯","鮮茄牛肉扎肉湯河"]
[null,null,null,null,null,null,null,null,null,null,null,null,null,null,null,"海皇豆腐煲",null,"麻辣烤魚",null,null,null,"北菇蒸雞飯",null,null,null,null,null,null,null,null,null,null,"豬頸肉餐肉飯",null,null,null,null,null,null," ",null,null,null," ",null,null,null,null,null,null,null,"蝦餅雞扒飯","冬蔭公雞絲豬肉丸湯河"]
[null,null,null,null,null,null,null,null,null,null,null,null,null,null,null,"海皇粉絲雑菜煲"," ","茄子倉魚",null,null,null,"粟米斑腩飯",null,null,null,null,null,null,null,null,null,null,"雞扒煎蛋鮮茄米粉",null,null,null,null,null,null," ",null,null,null,null,null,null,null,null,null,null,null,"肉碎伴太陽蛋飯","冬蔭公雞扒煎蛋河粉"]
[null,null,null,null,null,null,null,null,null,null,null,null,null,null,null,"粉絲海皇雜菜煲"," ",null,null,null,null,"茄子豆卜蝦球飯",null,null,null,null,null,null,null,null,null,null,"豬扒腸仔飯",null,null,null,null,null,null," ",null,null,null,null,null,null,null,null,null,null,null,"肉碎餐肉飯"]
{"$rows_left_out":93}
{"sheet":"FOOD TYPE MASTER","index":3,"n_rows":20,"n_cols":2,"rows_kept":20,"cut":false,"hidden":false,"merged":[]}
[]
[]
[null,"食材分類"]
[null,"無分類"]
[null,"豬"]
[null,"牛"]
[null,"羊"]
[null,"雞"]
[null,"鴨"]
[null,"鵝"]
[null,"鴿"]
[null,"雜肉"]
[null,"海鮮"]
[null,"菜"]
[null,"飲品"]
[null,"酒類"]
[null,"包類"]
[null,"粉麵飯"]
[null,"湯"]
[null,"無分類"]

{"sheet":"工作表1","index":4,"n_rows":58,"n_cols":8,"rows_kept":58,"cut":false,"hidden":false,"merged":[]}
["品味","D02274","607.豬頸肉拼春卷撈檬","午市小食",null,{"$f":"LOOKUP(1,0/((FoodItem[菜品編號]=B1)*(FoodItem[字號]=A1)),FoodItem[菜品編號])","v":"D02274"},{"$f":"LOOKUP(1,0/((FoodItem[菜品編號]=B1)*(FoodItem[字號]=A1)),FoodItem[食品名])","v":"607.豬頸肉拼春卷撈檬"},{"$f":"LOOKUP(1,0/((FoodItem[菜品編號]=B1)*(FoodItem[字號]=A1)),FoodItem[食品類別])","v":"午市小食"}]
["品味","D02275","608.三寶湯河(牛肉.扎肉.豬肚絲",null,null,{"$f":"LOOKUP(1,0/((FoodItem[菜品編號]=B2)*(FoodItem[字號]=A2)),FoodItem[菜品編號])","v":"D02275"},{"$f":"LOOKUP(1,0/((FoodItem[菜品編號]=B2)*(FoodItem[字號]=A2)),FoodItem[食品名])","v":"608.三寶湯河(牛肉.扎肉.豬肚絲"},{"$f":"LOOKUP(1,0/((FoodItem[菜品編號]=B2)*(FoodItem[字號]=A2)),FoodItem[食品類別])","v":"午市小食"}]
["品味","D02185","605.滑蛋叉燒飯",null,null,{"$f":"LOOKUP(1,0/((FoodItem[菜品編號]=B3)*(FoodItem[字號]=A3)),FoodItem[菜品編號])","v":"D02185"},{"$f":"LOOKUP(1,0/((FoodItem[菜品編號]=B3)*(FoodItem[字號]=A3)),FoodItem[食品名])","v":"605.蝦仁滑蛋飯"},{"$f":"LOOKUP(1,0/((FoodItem[菜品編號]=B3)*(FoodItem[字號]=A3)),FoodItem[食品類別])","v":"午市小食"}]
["品味","D02182","602.蝦餅肉碎飯","午市小食",null,{"$f":"LOOKUP(1,0/((FoodItem[菜品編號]=B4)*(FoodItem[字號]=A4)),FoodItem[菜品編號])","v":"D02182"},{"$f":"LOOKUP(1,0/((FoodItem[菜品編號]=B4)*(FoodItem[字號]=A4)),FoodItem[食品名])","v":"602.蝦餅肉碎飯"},{"$f":"LOOKUP(1,0/((FoodItem[菜品編號]=B4)*(FoodItem[字號]=A4)),FoodItem[食品類別])","v":"午市小食"}]
["品味","D02184","604.豬頸肉煎蛋飯","午市小食",null,{"$f":"LOOKUP(1,0/((FoodItem[菜品編號]=B5)*(FoodItem[字號]=A5)),FoodItem[菜品編號])","v":"D02184"},{"$f":"LOOKUP(1,0/((FoodItem[菜品編號]=B5)*(FoodItem[字號]=A5)),FoodItem[食品名])","v":"604.豬頸肉煎蛋飯"},{"$f":"LOOKUP(1,0/((FoodItem[菜品編號]=B5)*(FoodItem[字號]=A5)),FoodItem[食品類別])","v":"午市小食"}]
["品味","D02183","603.雞扒餐肉飯","午市小食",null,{"$f":"LOOKUP(1,0/((FoodItem[菜品編號]=B6)*(FoodItem[字號]=A6)),FoodItem[菜品編號])","v":"D02183"},{"$f":"LOOKUP(1,0/((FoodItem[菜品編號]=B6)*(FoodItem[字號]=A6)),FoodItem[食品名])","v":"603.豬扒腸仔飯"},{"$f":"LOOKUP(1,0/((FoodItem[菜品編號]=B6)*(FoodItem[字號]=A6)),FoodItem[食品類別])","v":"午市小食"}]
["品味","D02273","606.豬肚絲豬肉丸米線","午市小食",null,{"$f":"LOOKUP(1,0/((FoodItem[菜品編號]=B7)*(FoodItem[字號]=A7)),FoodItem[菜品編號])","v":"D02273"},{"$f":"LOOKUP(1,0/((FoodItem[菜品編號]=B7)*(FoodItem[字號]=A7)),FoodItem[食品名])","v":"606.豬肚絲扎肉米線"},{"$f":"LOOKUP(1,0/((FoodItem[菜品編號]=B7)*(FoodItem[字號]=A7)),FoodItem[食品類別])","v":0}]
["品味","D02275","608.三寶湯河(牛肉.扎肉.豬肚絲","午市小食",null,{"$f":"LOOKUP(1,0/((FoodItem[菜品編號]=B8)*(FoodItem[字號]=A8)),FoodItem[菜品編號])","v":"D02275"},{"$f":"LOOKUP(1,0/((FoodItem[菜品編號]=B8)*(FoodItem[字號]=A8)),FoodItem[食品名])","v":"608.三寶湯河(牛肉.扎肉.豬肚絲"},{"$f":"LOOKUP(1,0/((FoodItem[菜品編號]=B8)*(FoodItem[字號]=A8)),FoodItem[食品類別])","v":"午市小食"}]
["品味","D02185","605.滑蛋叉燒飯","午市小食",null,{"$f":"LOOKUP(1,0/((FoodItem[菜品編號]=B9)*(FoodItem[字號]=A9)),FoodItem[菜品編號])","v":"D02185"},{"$f":"LOOKUP(1,0/((FoodItem[菜品編號]=B9)*(FoodItem[字號]=A9)),FoodItem[食品名])","v":"605.蝦仁滑蛋飯"},{"$f":"LOOKUP(1,0/((FoodItem[菜品編號]=B9)*(FoodItem[字號]=A9)),FoodItem[食品類別])","v":"午市小食"}]
["品味","D02273","606.豬肚絲豬肉丸米線",null,null,{"$f":"LOOKUP(1,0/((FoodItem[菜品編號]=B10)*(FoodItem[字號]=A10)),FoodItem[菜品編號])","v":"D02273"},{"$f":"LOOKUP(1,0/((FoodItem[菜品編號]=B10)*(FoodItem[字號]=A10)),FoodItem[食品名])","v":"606.豬肚絲扎肉米線"},{"$f":"LOOKUP(1,0/((FoodItem[菜品編號]=B10)*(FoodItem[字號]=A10)),FoodItem[食品類別])","v":0}]
["品味","D02184","604.咖喱牛腩飯","午市小食",null,{"$f":"LOOKUP(1,0/((FoodItem[菜品編號]=B11)*(FoodItem[字號]=A11)),FoodItem[菜品編號])","v":"D02184"},{"$f":"LOOKUP(1,0/((FoodItem[菜品編號]=B11)*(FoodItem[字號]=A11)),FoodItem[食品名])","v":"604.豬頸肉煎蛋飯"},{"$f":"LOOKUP(1,0/((FoodItem[菜品編號]=B11)*(FoodItem[字號]=A11)),FoodItem[食品類別])","v":"午市小食"}]
["品味","D02185","605.蝦仁滑蛋飯","午市小食",null,{"$f":"LOOKUP(1,0/((FoodItem[菜品編號]=B12)*(FoodItem[字號]=A12)),FoodItem[菜品編號])","v":"D02185"},{"$f":"LOOKUP(1,0/((FoodItem[菜品編號]=B12)*(FoodItem[字號]=A12)),FoodItem[食品名])","v":"605.蝦仁滑蛋飯"},{"$f":"LOOKUP(1,0/((FoodItem[菜品編號]=B12)*(FoodItem[字號]=A12)),FoodItem[食品類別])","v":"午市小食"}]
["品味","D02183","603.豬扒腸仔飯","午市小食",null,{"$f":"LOOKUP(1,0/((FoodItem[菜品編號]=B13)*(FoodItem[字號]=A13)),FoodItem[菜品編號])","v":"D02183"},{"$f":"LOOKUP(1,0/((FoodItem[菜品編號]=B13)*(FoodItem[字號]=A13)),FoodItem[食品名])","v":"603.豬扒腸仔飯"},{"$f":"LOOKUP(1,0/((FoodItem[菜品編號]=B13)*(FoodItem[字號]=A13)),FoodItem[食品類別])","v":"午市小食"}]
["品味","D02273","606.豬肚絲扎肉米線","午市小食",null,{"$f":"LOOKUP(1,0/((FoodItem[菜品編號]=B14)*(FoodItem[字號]=A14)),FoodItem[菜品編號])","v":"D02273"},{"$f":"LOOKUP(1,0/((FoodItem[菜品編號]=B14)*(FoodItem[字號]=A14)),FoodItem[食品名])","v":"606.豬肚絲扎肉米線"},{"$f":"LOOKUP(1,0/((FoodItem[菜品編號]=B14)*(FoodItem[字號]=A14)),FoodItem[食品類別])","v":0}]
["品味","D02273","606.豬肚絲扎肉米線",null,null,{"$f":"LOOKUP(1,0/((FoodItem[菜品編號]=B15)*(FoodItem[字號]=A15)),FoodItem[菜品編號])","v":"D02273"},{"$f":"LOOKUP(1,0/((FoodItem[菜品編號]=B15)*(FoodItem[字號]=A15)),FoodItem[食品名])","v":"606.豬肚絲扎肉米線"},{"$f":"LOOKUP(1,0/((FoodItem[菜品編號]=B15)*(FoodItem[字號]=A15)),FoodItem[食品類別])","v":0}]
["品味","D02323","涼瓜肉碎煎蛋","（新）小菜套餐",null,{"$f":"LOOKUP(1,0/((FoodItem[菜品編號]=#REF!)*(FoodItem[字號]=A16)),FoodItem[菜品編號])","v":{"$error":"#N/A"}},{"$f":"LOOKUP(1,0/((FoodItem[菜品編號]=#REF!)*(FoodItem[字號]=A16)),FoodItem[食品名])","v":{"$error":"#N/A"}},{"$f":"LOOKUP(1,0/((FoodItem[菜品編號]=#REF!)*(FoodItem[字號]=A16)),FoodItem[食品類別])","v":{"$error":"#N/A"}}]
["品味","D02316","薯仔牛柳粒$78","（新）小菜套餐",null,{"$f":"LOOKUP(1,0/((FoodItem[菜品編號]=B16)*(FoodItem[字號]=A17)),FoodItem[菜品編號])","v":"D02323"},{"$f":"LOOKUP(1,0/((FoodItem[菜品編號]=B16)*(FoodItem[字號]=A17)),FoodItem[食品名])","v":"涼瓜肉碎煎蛋"},{"$f":"LOOKUP(1,0/((FoodItem[菜品編號]=B16)*(FoodItem[字號]=A17)),FoodItem[食品類別])","v":"（新）小菜套餐"}]
["品味","D02321","西蘭花炒蝦球$82","（新）小菜套餐",null,{"$f":"LOOKUP(1,0/((FoodItem[菜品編號]=B17)*(FoodItem[字號]=A18)),FoodItem[菜品編號])","v":"D02316"},{"$f":"LOOKUP(1,0/((FoodItem[菜品編號]=B17)*(FoodItem[字號]=A18)),FoodItem[食品名])","v":"薯仔牛柳粒$78"},{"$f":"LOOKUP(1,0/((FoodItem[菜品編號]=B17)*(FoodItem[字號]=A18)),FoodItem[食品類別])","v":"（新）小菜套餐"}]
["品味","D02313","滑蛋蝦仁飯$78","（新）小菜套餐",null,{"$f":"LOOKUP(1,0/((FoodItem[菜品編號]=B18)*(FoodItem[字號]=A19)),FoodItem[菜品編號])","v":"D02321"},{"$f":"LOOKUP(1,0/((FoodItem[菜品編號]=B18)*(FoodItem[字號]=A19)),FoodItem[食品名])","v":"西蘭花炒蝦球$82"},{"$f":"LOOKUP(1,0/((FoodItem[菜品編號]=B18)*(FoodItem[字號]=A19)),FoodItem[食品類別])","v":"（新）小菜套餐"}]
["品味","D02325","豉汁蒸倉魚","（新）小菜套餐",null,{"$f":"LOOKUP(1,0/((FoodItem[菜品編號]=B19)*(FoodItem[字號]=A20)),FoodItem[菜品編號])","v":"D02313"},{"$f":"LOOKUP(1,0/((FoodItem[菜品編號]=B19)*(FoodItem[字號]=A20)),FoodItem[食品名])","v":"滑蛋蝦仁飯$78"},{"$f":"LOOKUP(1,0/((FoodItem[菜品編號]=B19)*(FoodItem[字號]=A20)),FoodItem[食品類別])","v":"（新）小菜套餐"}]
["品味","D01027","焼鵝","燒味",null,{"$f":"LOOKUP(1,0/((FoodItem[菜品編號]=B20)*(FoodItem[字號]=A21)),FoodItem[菜品編號])","v":"D02325"},{"$f":"LOOKUP(1,0/((FoodItem[菜品編號]=B20)*(FoodItem[字號]=A21)),FoodItem[食品名])","v":"豉汁蒸倉魚"},{"$f":"LOOKUP(1,0/((FoodItem[菜品編號]=B20)*(FoodItem[字號]=A21)),FoodItem[食品類別])","v":"（新）小菜套餐"}]
["品味","D01028","焼腩仔","燒味",null,{"$f":"LOOKUP(1,0/((FoodItem[菜品編號]=B21)*(FoodItem[字號]=A22)),FoodItem[菜品編號])","v":"D01027"},{"$f":"LOOKUP(1,0/((FoodItem[菜品編號]=B21)*(FoodItem[字號]=A22)),FoodItem[食品名])","v":"焼鵝"},{"$f":"LOOKUP(1,0/((FoodItem[菜品編號]=B21)*(FoodItem[字號]=A22)),FoodItem[食品類別])","v":"燒味"}]
["品味","D01029","叉焼","燒味",null,{"$f":"LOOKUP(1,0/((FoodItem[菜品編號]=B22)*(FoodItem[字號]=A23)),FoodItem[菜品編號])","v":"D01028"},{"$f":"LOOKUP(1,0/((FoodItem[菜品編號]=B22)*(FoodItem[字號]=A23)),FoodItem[食品名])","v":"焼腩仔"},{"$f":"LOOKUP(1,0/((FoodItem[菜品編號]=B22)*(FoodItem[字號]=A23)),FoodItem[食品類別])","v":"燒味"}]
["品味","D02315","菠蘿咕嚕肉$68","（新）小菜套餐",null,{"$f":"LOOKUP(1,0/((FoodItem[菜品編號]=B23)*(FoodItem[字號]=A24)),FoodItem[菜品編號])","v":"D01029"},{"$f":"LOOKUP(1,0/((FoodItem[菜品編號]=B23)*(FoodItem[字號]=A24)),FoodItem[食品名])","v":"叉焼"},{"$f":"LOOKUP(1,0/((FoodItem[菜品編號]=B23)*(FoodItem[字號]=A24)),FoodItem[食品類別])","v":"燒味"}]
["品味","D02324","涼瓜豬肚煲","（新）小菜套餐",null,{"$f":"LOOKUP(1,0/((FoodItem[菜品編號]=B24)*(FoodItem[字號]=A25)),FoodItem[菜品編號])","v":"D02315"},{"$f":"LOOKUP(1,0/((FoodItem[菜品編號]=B24)*(FoodItem[字號]=A25)),FoodItem[食品名])","v":"菠蘿咕嚕肉$68"},{"$f":"LOOKUP(1,0/((FoodItem[菜品編號]=B24)*(FoodItem[字號]=A25)),FoodItem[食品類別])","v":"（新）小菜套餐"}]
["品味","D02317","香茅豬扒(1份)","（新）小菜套餐",null,{"$f":"LOOKUP(1,0/((FoodItem[菜品編號]=B25)*(FoodItem[字號]=A26)),FoodItem[菜品編號])","v":"D02324"},{"$f":"LOOKUP(1,0/((FoodItem[菜品編號]=B25)*(FoodItem[字號]=A26)),FoodItem[食品名])","v":"涼瓜豬肚煲"},{"$f":"LOOKUP(1,0/((FoodItem[菜品編號]=B25)*(FoodItem[字號]=A26)),FoodItem[食品類別])","v":"（新）小菜套餐"}]
["品味","D02327","時菜炒牛肉","（新）小菜套餐",null,{"$f":"LOOKUP(1,0/((FoodItem[菜品編號]=B26)*(FoodItem[字號]=A27)),FoodItem[菜品編號])","v":"D02317"},{"$f":"LOOKUP(1,0/((FoodItem[菜品編號]=B26)*(FoodItem[字號]=A27)),FoodItem[食品名])","v":"香茅豬扒(1份)"},{"$f":"LOOKUP(1,0/((FoodItem[菜品編號]=B26)*(FoodItem[字號]=A27)),FoodItem[食品類別])","v":"（新）小菜套餐"}]
["品味","D02322","茄子枝竹煲","（新）小菜套餐",null,{"$f":"LOOKUP(1,0/((FoodItem[菜品編號]=B27)*(FoodItem[字號]=A28)),FoodItem[菜品編號])","v":"D02327"},{"$f":"LOOKUP(1,0/((FoodItem[菜品編號]=B27)*(FoodItem[字號]=A28)),FoodItem[食品名])","v":"時菜炒牛肉"},{"$f":"LOOKUP(1,0/((FoodItem[菜品編號]=B27)*(FoodItem[字號]=A28)),FoodItem[食品類別])","v":"（新）小菜套餐"}]
["品味","D01380","酸辣無骨鳯爪","(新)小食",null,{"$f":"LOOKUP(1,0/((FoodItem[菜品編號]=B28)*(FoodItem[字號]=A29)),FoodItem[菜品編號])","v":"D02322"},{"$f":"LOOKUP(1,0/((FoodItem[菜品編號]=B28)*(FoodItem[字號]=A29)),FoodItem[食品名])","v":"茄子枝竹煲"},{"$f":"LOOKUP(1,0/((FoodItem[菜品編號]=B28)*(FoodItem[字號]=A29)),FoodItem[食品類別])","v":"（新）小菜套餐"}]
["品味","D02311","南乳豬手(大)","（新）小菜套餐",null,{"$f":"LOOKUP(1,0/((FoodItem[菜品編號]=B29)*(FoodItem[字號]=A30)),FoodItem[菜品編號])","v":"D01380"},{"$f":"LOOKUP(1,0/((FoodItem[菜品編號]=B29)*(FoodItem[字號]=A30)),FoodItem[食品名])","v":"酸辣無骨鳯爪"},{"$f":"LOOKUP(1,0/((FoodItem[菜品編號]=B29)*(FoodItem[字號]=A30)),FoodItem[食品類別])","v":"(新)小食"}]
{"$rows_left_out":28}